Macro-economie
type: Concept
narrower: Arbeidsinkomensquote

Inkomen uit arbeid (NR)
type: Concept
related: Arbeidsinkomensquote
type: CBS begrip
preferred label: Income from work @en

Loonquote
type: Concept
related: Arbeidsinkomensquote
type: CBS begrip

Arbeidsinkomensquote
type: Concept
type: CBS begrip
in scheme: Begrippen CBS
preferred label: Labour income quote @en
alternative label: Aiq
definition: Het aandeel van de beloning voor arbeid in de netto toegevoegde waarde.
definition: The share of the rewards for labour in the net value added in the economy. The pay for labour includes the pay for employees plus the attributed pay for self-employed people and family-members working in the family business. @en
note: Vorige versie: de beloning voor arbeid is de loonsom van werknemers plus de toegerekende beloning voor zelfstandigen en meewerkende gezinsleden.
version info: 2
broader: Macro-economie
scope note: Voor werknemers staat het arbeidsinkomen gelijk aan de beloning: de lonen plus de sociale premies ten laste van werkgevers. Voor zelfstandigen wordt het netto gemengd inkomen als benadering voor het arbeidsinkomen genomen. Het netto gemengd inkomen bevat in de praktijk naast de beloning van arbeid echter ook de beloning voor kapitaal en ondernemerschap (winst).
source: arbeidsinkomensquote
modified: 2023-03-29T15:52:14Z
created: 2009-01-03T23:00:00Z
history note: De toelichting is uitgebreid.
subject: https://taxonomie.cbs.nl/vocab/id/1905
related: Inkomen uit arbeid (NR)
related: Loonquote

Begrippen CBS
type: ConceptScheme
preferred label: Concepts Statistics Netherlands @en

CBS begrip
label: CBS concept @en