Veiligheid en recht
type: Concept
narrower: Schennis der eerbaarheid

Schennis der eerbaarheid
type: Concept
type: CBS begrip
in scheme: Begrippen CBS
definition: Misdrijf tegen de openbare orde, omschreven in artikel 239 Wetboek van Strafrecht.
version info: 1
broader: Veiligheid en recht
scope note: Het bekendste voorbeeld hiervan is ‘potloodventen’.
source: schennis-der-eerbaarheid
modified: 2022-02-23T15:55:20Z
created: 2016-03-23T09:14:50Z

CBS begrip
label: CBS concept @en

Begrippen CBS
type: ConceptScheme
preferred label: Concepts Statistics Netherlands @en