Zorg en gezondheid
type: Concept
narrower: Ziekenfondswet

Ziekenfondswet
type: Concept
type: CBS begrip
in scheme: Begrippen CBS
preferred label: Compulsory health insurance act (ZFW) @en
alternative label: ZFW
definition: Per 1 januari 2006 buiten werking gestelde wet die tot doel had om personen met een inkomen beneden de loongrens te verzekeren van een goede geneeskundige verzorging. De wet gaf geen recht op geld, maar op de gezondheidsvoorzieningen zelf (in natura). Vanaf 1 januari 2006 opgevolgd door de Zorgverzekeringswet.
definition: Law that was in force until 1 January 2006. The aim of the law was to ensure people whose income is below the threshold of proper health care under the compulsory health insurance act . The law does not provide for cash payments but for health provisions @en
version info: 1
broader: Zorg en gezondheid
source: ziekenfondswet--zfw--
modified: 2022-02-23T15:56:33Z
created: 2016-03-23T09:08:12Z

CBS begrip
label: CBS concept @en

Begrippen CBS
type: ConceptScheme
preferred label: Concepts Statistics Netherlands @en