Bevolking
type: Concept
narrower: Algemeen vruchtbaarheidscijfer

Algemeen vruchtbaarheidscijfer
type: Concept
type: CBS begrip
in scheme: Begrippen CBS
preferred label: General fertility rate @en
definition: Het aantal levendgeborenen per duizend van het gemiddeld aantal vrouwen van 15 tot 50 jaar in een bepaalde periode (meestal een kalenderjaar).
definition: The number of live born babies per 1000 of the average number of women aged 15 to 50 in a certain period (usually a calendar year) @en
version info: 1
broader: Bevolking
source: algemeen-vruchtbaarheidscijfer
modified: 2022-02-23T15:52:20Z
created: 2016-03-23T09:06:08Z

CBS begrip
label: CBS concept @en

Begrippen CBS
type: ConceptScheme
preferred label: Concepts Statistics Netherlands @en