Veiligheid en recht
type: Concept
narrower: Alimentatie

Nevenvoorziening echtscheidingsprocedure
type: Concept
related: Alimentatie
type: CBS begrip

Alimentatie
type: Concept
type: CBS begrip
in scheme: Begrippen CBS
preferred label: Alimony @en
definition: Financiële bijdrage van een gescheiden persoon aan het levensonderhoud van zijn/haar kind(eren) (kinderalimentatie) of aan dat van de ex-partner (partneralimentatie).
definition: Financial contribution of a divorcee to the upkeep of his/her child/children (child maintenance) or ex-partner (partner alimony) @en
version info: 1
broader: Veiligheid en recht
source: alimentatie
modified: 2022-02-23T15:52:21Z
created: 2016-03-23T09:15:29Z
related: Nevenvoorziening echtscheidingsprocedure

Begrippen CBS
type: ConceptScheme
preferred label: Concepts Statistics Netherlands @en

CBS begrip
label: CBS concept @en