Bevolking
type: Concept
narrower: Sterfte

Sterfte
type: Concept
type: CBS begrip
in scheme: Begrippen CBS
preferred label: Mortality @en
definition: Het aantal personen dat is overleden waarbij een bevoegde arts een overlijdensakte heeft ondertekend.
definition: The total number of people pronounced dead by an authorized medical doctor in a given period. @en
version info: 1
broader: Bevolking
scope note: Overledenen worden geteld naar de woongemeente en niet naar de gemeente van overlijden. In CBS-statistieken heeft sterfte betrekking op het aantal personen dat tijdens het overlijden in het bevolkingsregister van een Nederlandse gemeente is opgenomen, ongeacht het land waar het overlijden heeft plaatsgevonden. Personen die niet in Nederland wonen maar wel hier overlijden worden niet meegeteld.
source: sterfte
modified: 2022-02-23T15:55:37Z
created: 2016-03-23T09:05:41Z

CBS begrip
label: CBS concept @en

Begrippen CBS
type: ConceptScheme
preferred label: Concepts Statistics Netherlands @en