Arbeid en sociale zekerheid
type: Concept
narrower: Incidentele loonontwikkeling

Incidentele loonontwikkeling
type: Concept
type: CBS begrip
in scheme: Begrippen CBS
preferred label: Incidental wage development @en
definition: Dat deel van de ontwikkeling van het gemiddeld verdiend loon, dat niet resulteert uit CAO-wijzigingen. De incidentele loonontwikkeling wordt gesplitst in het demografisch-economisch effect en overige effecten.
definition: The part of the development of the average earned wage that does not result from a collective labour agreement change. It is divided into demographic-economic effects and other effects. @en
version info: 1
broader: Arbeid en sociale zekerheid
scope note: Het verschil tussen de ontwikkeling van de feitelijk verdiende lonen en de loonontwikkeling zoals overeengekomen in CAO's en vergelijkbare collectieve regelingen. Het demografisch-economisch effect is het deel van de incidentele loonontwikkeling dat verklaard wordt door veranderingen in samenstelling van de werknemerspopulatie. Het betreft hier veranderingen in samenstelling van geslacht, leeftijd en dienstverband. De overige effecten zijn het deel van de incidentele loonontwikkeling dat niet verklaard wordt uit het demografisch-economisch effect.
source: incidentele-loonontwikkeling
modified: 2022-02-23T15:53:54Z
created: 2016-03-23T09:04:53Z

CBS begrip
label: CBS concept @en

Begrippen CBS
type: ConceptScheme
preferred label: Concepts Statistics Netherlands @en