Zorg en gezondheid
type: Concept
narrower: Euthanasie

Euthanasie
type: Concept
type: CBS begrip
in scheme: Begrippen CBS
preferred label: Euthanasia @en
definition: De opzettelijke beëindiging van het leven door een ander dan de betrokkene op diens uitdrukkelijke verzoek.
definition: The intentional ending of a person’s life by someone other than the person involved at his or her explicit request. @en
version info: 1
broader: Zorg en gezondheid
scope note: Voor de statistiek is sprake van euthanasie indien de arts heeft aangegeven dat het overlijden van de patiënt het gevolg is geweest van het gebruik van een middel dat door hem/haar of door een collega is voorgeschreven, verstrekt of toegediend met het uitdrukkelijke doel het levenseinde te bespoedigen én tevens is aangegeven dat de patiënt het middel niet uitsluitend zelf heeft toegediend of tot zich heeft genomen én dat deze beslissing is genomen op uitdrukkelijk verzoek van de patiënt.
source: euthanasie
modified: 2022-02-23T15:53:28Z
created: 2016-03-23T09:06:46Z

CBS begrip
label: CBS concept @en

Begrippen CBS
type: ConceptScheme
preferred label: Concepts Statistics Netherlands @en