Natuur en milieu
type: Concept
narrower: Bedrijfsafvalstoffen

Bedrijfsafvalstoffen
type: Concept
type: CBS begrip
in scheme: Begrippen CBS
preferred label: Industrial waste @en
definition: De in een bedrijf vrijkomende stoffen (materialen), die voor de houder nauwelijks of geen waarde hebben en waarvan deze zich wil ontdoen.
definition: Material of little value to the company that the company wants to dispose of (Environmental Management Act, C.1, art. 1.1).Exceptions are:radioactive waste; hazardous waste registered with the Dutch Waste Administration Office (LMA); construction and de @en
version info: 1
broader: Natuur en milieu
scope note: (Wet Milieubeheer, Hfdst. 1, art. 1.1)
source: bedrijfsafvalstoffen
modified: 2022-02-23T15:52:35Z
created: 2016-03-23T09:09:22Z

CBS begrip
label: CBS concept @en

Begrippen CBS
type: ConceptScheme
preferred label: Concepts Statistics Netherlands @en