Arbeid en sociale zekerheid
type: Concept
narrower: Wet terugdringing arbeidsongeschiktheidsvolume (TAV)

Wet terugdringing arbeidsongeschiktheidsvolume (TAV)
type: Concept
type: CBS begrip
in scheme: Begrippen CBS
preferred label: Reduction of disablement volume Act (TAV) @en
definition: Wet die als doel heeft om de instroom in arbeidsongeschiktheidswetten te belemmeren en de uitstroom te bevorderen.
definition: The aim of the law is to curb the inflow into, and stimulate the outflow out of disablement provisions. @en
version info: 1
broader: Arbeid en sociale zekerheid
source: wet-terugdringing-arbeidsongeschiktheidsvolume--tav--
modified: 2022-02-23T15:56:27Z
created: 2016-03-23T09:09:56Z

CBS begrip
label: CBS concept @en

Begrippen CBS
type: ConceptScheme
preferred label: Concepts Statistics Netherlands @en