Bedrijven
type: Concept
narrower: Inkopen grond- en hulpstoffen.

Inkopen grond- en hulpstoffen.
type: Concept
type: CBS begrip
in scheme: Begrippen CBS
preferred label: Purchased raw and auxiliary materials @en
definition: De kosten van de in de verslagperiode ingekochte grond- en hulpstoffen en verpakkingsmiddelen voor eenmalig gebruik ten behoeve van het productieproces.
definition: The value of purchased raw and auxiliary materials (including purchased semi-finished products) and packing material for single use in the production process. @en
version info: 1
broader: Bedrijven
scope note: Deze kosten zijn inclusief invoerrechten en opslagkosten maar exclusief kortingen, bonussen, retourzendingen en retouremballage, btw, terugontvangen invoerrechten, accijnzen en heffingen.
source: inkopen-grond-en-hulpstoffen-
modified: 2022-02-23T15:53:57Z
created: 2016-03-23T09:19:03Z

CBS begrip
label: CBS concept @en

Begrippen CBS
type: ConceptScheme
preferred label: Concepts Statistics Netherlands @en