Arbeid en sociale zekerheid
type: Concept
narrower: Nettoloon

Nettoloon
type: Concept
type: CBS begrip
in scheme: Begrippen CBS
preferred label: Net wage @en
definition: Het brutoloon verminderd met de werknemerspremies voor pensioen, VUT, werknemersverzekeringen en ziektekostenverzekering, eventueel vermeerderd met de overhevelingstoeslag en vervolgens verminderd met de loonbelasting en de premies volksverzekeringen.
definition: The gross wage minus pension premiums, early retirement and health insurance paid by the employee, if applicable plus transfer and minus wage tax and social security premiums. @en
version info: 1
broader: Arbeid en sociale zekerheid
source: nettoloon
modified: 2022-02-23T15:54:31Z
created: 2016-03-23T09:05:00Z

CBS begrip
label: CBS concept @en

Begrippen CBS
type: ConceptScheme
preferred label: Concepts Statistics Netherlands @en