Bevolking
type: Concept
narrower: Gemeentelijk bevolkingsregister

Gemeentelijk bevolkingsregister
type: Concept
type: CBS begrip
in scheme: Begrippen CBS
definition: Register waarin alle inwoners van een gemeente behoren te zijn ingeschreven.
version info: 1
broader: Bevolking
scope note: De Wet gemeentelijke basisadministratie persoonsgegevens (GBA) vormt de grondslag voor de gemeentelijke bevolkingsregisters. Vanaf januari 2014 is de Wet GBA vervangen door de Wet basisregistratie personen (Wet BRP). Uitgezonderd zijn: - inwoners van Nederland die gebruik maken van uitzonderingsregels die gelden met betrekking tot opneming in de bevolkingsregisters (niet-Nederlandse diplomaten en niet-Nederlandse NAVO-militairen). Zij mogen zelf bepalen of zij in de bevolkingsregisters ingeschreven worden of niet. - asielzoekers die korter dan zes maanden in de centrale opvang verblijven en nog geen verblijfsvergunning hebben gekregen.
source: gemeentelijk-bevolkingsregister
modified: 2022-02-23T15:53:36Z
created: 2016-03-23T09:15:13Z

CBS begrip
label: CBS concept @en

Begrippen CBS
type: ConceptScheme
preferred label: Concepts Statistics Netherlands @en