Onderwijs
type: Concept
narrower: Extraneï

Extraneï
type: Concept
type: CBS begrip
in scheme: Begrippen CBS
definition: Leerlingen of studenten die uitsluitend ingeschreven staan om examen te doen.
version info: 1
broader: Onderwijs
scope note: In het middelbaar beroeps- en hoger onderwijs bestaat de mogelijkheid om zich in te schrijven voor een examen zonder lessen of colleges te volgen.
source: extranei
modified: 2022-02-23T15:53:28Z
created: 2016-03-23T09:14:30Z

CBS begrip
label: CBS concept @en

Begrippen CBS
type: ConceptScheme
preferred label: Concepts Statistics Netherlands @en