Arbeid en sociale zekerheid
type: Concept
narrower: Arbeidsplaats

Baan
type: Concept
related: Arbeidsplaats
type: CBS begrip
preferred label: Job @en

Arbeidsplaats
type: Concept
type: CBS begrip
in scheme: Begrippen CBS
preferred label: Position @en
definition: Een plaats waar arbeid kan worden verricht door één werkzame persoon.
definition: A position in which one person can be employed. @en
version info: 2
broader: Arbeid en sociale zekerheid
scope note: Het gaat hierbij om banen en vacatures. De te verrichten arbeid kan soms in brokstukken worden verdeeld over meerdere personen. Er ontstaan dan meerdere arbeidsplaatsen.
source: arbeidsplaats
modified: 2023-03-29T15:52:14Z
created: 2016-03-23T09:03:44Z
related: Baan

Begrippen CBS
type: ConceptScheme
preferred label: Concepts Statistics Netherlands @en

CBS begrip
label: CBS concept @en