Arbeid en sociale zekerheid
type: Concept
narrower: Arbeidsongeschiktheidsregelingen

Arbeidsongeschiktheidswetten
type: Concept
related: Arbeidsongeschiktheidsregelingen
type: CBS begrip
preferred label: Disablement legislation @en

Arbeidsongeschiktheidsregelingen
type: Concept
type: CBS begrip
in scheme: Begrippen CBS
preferred label: Disablement provisions @en
definition: Hiertoe worden gerekend de Ongevallenwetten 1901 en 1921 (1901-1967), de Land- en Tuinbouwongevallenwet (1922-1967), de Invaliditeitswet (1919-1967), de Wet op de Arbeidsongeschiktheidsverzekering (vanaf 1967), en de Algemene Arbeidsongeschiktheidswet (1976-1998), de Wet arbeidsongeschiktheids-verzekering Zelfstandigen (vanaf 1998), de Wet arbeidsongeschiktheidsvoorziening jonggehandicapten (vanaf 1998), de Wet werk en inkomen naar arbeidsvermogen (vanaf 2006), de Wet werk en arbeidsondersteuning jonggehandicapten (vanaf 2010).
definition: These include the law on industrial accidents of 1901 and 1921, the law on accidents in agriculture and horticulture of 1922-1967, the law on invalidity (since 1919), the law on industrial disability insurance (since 1969) and the General disablement act @en
version info: 1
broader: Arbeid en sociale zekerheid
source: arbeidsongeschiktheidsregelingen
modified: 2023-10-01T11:11:08
created: 2016-03-23T09:05:07Z
related: Arbeidsongeschiktheidswetten

Begrippen CBS
type: ConceptScheme
preferred label: Concepts Statistics Netherlands @en

CBS begrip
label: CBS concept @en