Onderwijs
type: Concept
narrower: Muziekschool

Muziekschool
type: Concept
type: CBS begrip
in scheme: Begrippen CBS
preferred label: Music school @en
definition: Instelling waar muzieklessen en soms ook danslessen gegeven worden.
definition: Institutions providing courses in music and sometimes dance. @en
version info: 1
broader: Onderwijs
source: muziekschool
modified: 2022-02-23T15:54:28Z
created: 2016-03-23T09:11:40Z

CBS begrip
label: CBS concept @en

Begrippen CBS
type: ConceptScheme
preferred label: Concepts Statistics Netherlands @en