Arbeid en sociale zekerheid
type: Concept
narrower: Werkenden met subsidie gemeenten

Werkenden met subsidie gemeenten
type: Concept
type: CBS begrip
in scheme: Begrippen CBS
definition: Personen van 15 jaar tot de AOW-gerechtigde leeftijd voor wie de gemeente een door de gemeente gefinancierde voorziening heeft ingezet waarbij er sprake is van een loondienstverband en de voorziening behoort tot de typen Wet Sociale Werkvoorziening (WSW), de Wet Inschakeling Werkzoekenden (WIW), het Besluit in- en doorstroombanen (ID), Tijdelijke loonkostensubsidie, Loonkostensubsidie Participatiewet of een andere voorziening voor arbeidsbeperkten in het kader van de Participatiewet.”
version info: 1
broader: Arbeid en sociale zekerheid
source: werkenden-met-subsidie-gemeenten
modified: 2022-02-23T15:56:23Z
created: 2016-09-13T05:53:22Z

CBS begrip
label: CBS concept @en

Begrippen CBS
type: ConceptScheme
preferred label: Concepts Statistics Netherlands @en