Arbeid en sociale zekerheid
type: Concept
narrower: Wettelijke sociale lasten

Wettelijke sociale lasten
type: Concept
type: CBS begrip
in scheme: Begrippen CBS
preferred label: Compulsory social contributions @en
definition: De premies die werkgevers verschuldigd zijn op grond van een aantal sociale verzekeringswetten.
definition: Premiums payable by the employer on the basis of several social insurance laws such as the AOW (pensions), ZFW (health insurance) and WW (unemployment) as well as premium transfers. @en
version info: 1
broader: Arbeid en sociale zekerheid
scope note: Dit zijn o.a. de WAO (vanaf 29-12-2005 vervangen door de WIA), de ZFW (vanaf 1-1-2006 vervangen door de ZVW) en de WW, alsmede de overhevelingstoeslag.
source: wettelijke-sociale-lasten
modified: 2022-02-23T15:56:28Z
created: 2016-03-23T09:10:19Z

CBS begrip
label: CBS concept @en

Begrippen CBS
type: ConceptScheme
preferred label: Concepts Statistics Netherlands @en