Verkeer en vervoer
type: Concept
narrower: Oplegger

Oplegger
type: Concept
type: CBS begrip
in scheme: Begrippen CBS
preferred label: Semi-trailer @en
definition: Wegvoertuig voor goederenvervoer zonder vooras, dat zodanig is ontworpen dat een gedeelte van het voertuig en een belangrijk gedeelte van zijn lading op een trekker voor het wegverkeer rust.
definition: Goods road vehicle with no front axle designed in such way that part of the vehicle and a substantial part of its loaded weight rests on the road tractor. @en
version info: 1
broader: Verkeer en vervoer
scope note: Met ingang van september 2003 dienen aanhangwagens en opleggers te zijn voorzien van een geldig kenteken. Vanaf 2004 zijn deze categorieën opgenomen in de overzichten van de statistiek motorvoertuigen.
source: oplegger
modified: 2022-02-23T15:54:46Z
created: 2016-03-23T09:19:39Z

CBS begrip
label: CBS concept @en

Begrippen CBS
type: ConceptScheme
preferred label: Concepts Statistics Netherlands @en