Arbeid en sociale zekerheid
type: Concept
narrower: Geschil

Geschil
type: Concept
type: CBS begrip
in scheme: Begrippen CBS
preferred label: Labour dispute @en
definition: Gemeenschappelijke noemer voor een werkstaking, een werkonderbreking, een uitsluiting van werknemers door de werkgever, of voor een reeks van meerdere samenhangende werkstakingen, werkonderbrekingen of uitsluitingen.
definition: Ground for a strike, work interruption, employee exclusion by the employer, or a series of related strikes, work interruptions or lock-outs. @en
version info: 1
broader: Arbeid en sociale zekerheid
scope note: De eenheid van telling in de Statistiek Werkstakingen. Een geschil kan meerdere geschilpunten omvatten. Geschilpunten kunnen betrekking hebben op arbeidsvoorwaarden, zoals: loonsverhoging of andere loonkwesties, werktijd, CAO-onderhandelingen. Ook kunnen conflicten ontstaan om andere redenen, bijvoorbeeld bij reorganisaties.
source: geschil
modified: 2022-02-23T15:53:40Z
created: 2016-03-23T09:08:12Z

CBS begrip
label: CBS concept @en

Begrippen CBS
type: ConceptScheme
preferred label: Concepts Statistics Netherlands @en