Arbeid en sociale zekerheid
type: Concept
narrower: Niet-uitkeringsgerechtigde (in het kader van de Participatiewet)

Niet-uitkeringsgerechtigde (in het kader van de Participatiewet)
type: Concept
type: CBS begrip
in scheme: Begrippen CBS
definition: Een persoon jonger dan de pensioengerechtigde leeftijd, die als werkloze werkzoekende staat geregistreerd bij het Uitvoeringsinstituut werknemersverzekeringen (UWV) en die geen recht heeft op een uitkering of arbeidsondersteuning op grond van de Participatiewet of de Werkloosheidswet, de Wet inkomensvoorziening oudere werklozen, de Wet arbeidsongeschiktheidsverzekering zelfstandigen, de Wet arbeidsongeschiktheidsvoorziening jonggehandicapten8, de Wet werk en inkomen naar arbeidsvermogen, de Wet op de arbeidsongeschiktheidsverzekering, de Toeslagenwet, de Tijdelijke wet beperking inkomensgevolgen arbeidsongeschiktheidscriteria, de Algemene nabestaandenwet dan wel op grond van een regeling, die met deze wetten naar aard en strekking overeenstemt.
version info: 1
broader: Arbeid en sociale zekerheid
scope note: In de Participatiewet wordt in het kader van de gemeentelijke taak tot sociale activering, die vooral gericht is op arbeidsinschakeling via re-integratiemaatregelen, naast de populatie bijstandontvangers ook de populatie niet-uitkeringsgerechtigden onderscheiden. In artikel 6 van de Participatiewet wordt deze nader gedefinieerd. Mensen die tot de populatie niet-uitkeringsgerechtigden (NUG) behoren, kunnen aanspraak maken op ondersteuning van de gemeente waarin zij wonen bij het zoeken naar werk (re-integratie).
source: niet-uitkeringsgerechtigde--in-het-kader-van-de-participatiewet--
modified: 2022-02-23T15:54:34Z
created: 2016-05-04T09:24:31Z

CBS begrip
label: CBS concept @en

Begrippen CBS
type: ConceptScheme
preferred label: Concepts Statistics Netherlands @en