Bevolking
type: Concept
narrower: Land van bestemming

Land van bestemming
type: Concept
type: CBS begrip
in scheme: Begrippen CBS
preferred label: Country of destination @en
definition: Land waar een emigrant zich na vertrek uit Nederland vestigt.
definition: Country where an emigrant will live after leaving the Netherlands. @en
version info: 1
broader: Bevolking
source: land-van-bestemming
modified: 2022-02-23T15:54:11Z
created: 2016-03-23T09:11:02Z

CBS begrip
label: CBS concept @en

Begrippen CBS
type: ConceptScheme
preferred label: Concepts Statistics Netherlands @en