Onderwijs
type: Concept
narrower: Voortgezet algemeen volwassenenonderwijs

Voorbereidend wetenschappelijk onderwijs
type: Concept
related: Voortgezet algemeen volwassenenonderwijs
type: CBS begrip

Hoger algemeen voortgezet onderwijs
type: Concept
related: Voortgezet algemeen volwassenenonderwijs
type: CBS begrip

Volwasseneneducatie
type: Concept
related: Voortgezet algemeen volwassenenonderwijs
type: CBS begrip
preferred label: Adult education @en

Voorbereidend middelbaar beroepsonderwijs
type: Concept
related: Voortgezet algemeen volwassenenonderwijs
type: CBS begrip
preferred label: Prevocational secondary education @en

Voortgezet algemeen volwassenenonderwijs
type: Concept
type: CBS begrip
in scheme: Begrippen CBS
preferred label: Adult general secondary education @en
alternative label: Vavo
definition: Tweedekansonderwijs, waarbij volwassenen alsnog hun diploma of een deelcertificaat op het niveau van de theoretische leerweg van het voorbereidend middelbaar beroepsonderwijs (vmbo, voorheen mavo), hoger algemeen voortgezet onderwijs (havo) of het voorbereidend wetenschappelijk onderwijs (vwo) kunnen behalen.
definition: Education for adults at the secondary level, provided since 1993 at the lower and higher secondary levels (mavo, havo and vwo) and also for Dutch as a second language for highly educated people. @en
version info: 1
broader: Onderwijs
scope note: Het voortgezet algemeen volwassenenonderwijs is in 1993/’94 van start gegaan. Bij de invoering van de Wet Educatie en Beroepsonderwijs (WEB) op 1 januari 1996 ging het vavo op in de kwalificatiestructuur educatie (KSE). In het schooljaar 1997/’98 is de landelijke kwalificatiestructuur ingevoerd en viel het vavo uiteen in de KSE-niveaus 4-6. KSE 4 kwam daarbij overeen met de theoretische leerweg van het vmbo (voorheen mavo), KSE 5 met het niveau van de havo en KSE 6 met niveau van het vwo. Met ingang van het schooljaar 2004/’05 is het Ministerie van Onderwijs, Cultuur en Wetenschap (OCW) met de terminologie KSE 4-6 gestopt en wordt voor het voortgezet algemeen volwassenenonderwijs weer de afkorting vavo gebruikt met de niveaus vmbo theoretische leerweg, havo en vwo.
source: voortgezet-algemeen-volwassenenonderwijs--vavo--
modified: 2022-02-23T15:56:15Z
created: 2016-03-23T09:08:42Z
related: Voorbereidend wetenschappelijk onderwijs
related: Hoger algemeen voortgezet onderwijs
related: Volwasseneneducatie
related: Voorbereidend middelbaar beroepsonderwijs

Begrippen CBS
type: ConceptScheme
preferred label: Concepts Statistics Netherlands @en

CBS begrip
label: CBS concept @en