Bedrijven
type: Concept
narrower: Particuliere instelling zonder winstoogmerk.

Instelling zonder winstoogmerk
type: Concept
related: Particuliere instelling zonder winstoogmerk.
type: CBS begrip
preferred label: Non-profit institution (NPI) @en

Particuliere instelling zonder winstoogmerk.
type: Concept
type: CBS begrip
in scheme: Begrippen CBS
preferred label: Private non-profit institution @en
alternative label: IZWp
definition: A non-profit institution that is not governed and not financed mainly by government. @en
definition: Een instelling zonder winstoogmerk die niet onder toezicht staat en niet hoofdzakelijk wordt gefinancierd door de overheid.
note: Vorige definitie: Een IZW die niet onder toezicht staat en niet hoofdzakelijk wordt gefinancierd door de overheid.
version info: 2
broader: Bedrijven
scope note: Indien meer dan 50% van de productiekosten door verkopen wordt gedekt is het een particuliere IZW ten behoeve van bedrijven (IZWb). Voorbeelden van IZWb zijn onderzoeks- en testlaboratoria, werkgeversorganisaties en beroepsverenigingen. Ze worden ingedeeld in de sector niet-financiële vennootschappen of de sector financiële instellingen. Indien minder dan 50% van de productiekosten wordt gedekt door verkopen is het een particuliere IZW ten behoeve van huishoudens (IZWh) die bij de sector huishoudens wordt ingedeeld. Voorbeelden daarvan zijn vakbonden, sportclubs en kerkgenootschappen.
source: particuliere-instelling-zonder-winstoogmerk--izwp--
modified: 2023-03-29T15:52:14Z
created: 2016-03-23T09:12:01Z
history note: De definitie is aangepast
related: Instelling zonder winstoogmerk

Begrippen CBS
type: ConceptScheme
preferred label: Concepts Statistics Netherlands @en

CBS begrip
label: CBS concept @en