Arbeid en sociale zekerheid
type: Concept
narrower: Positie in de werkkring

Zelfstandige
type: Concept
related: Positie in de werkkring
type: CBS begrip
preferred label: Self-employed person @en

Werknemer
type: Concept
related: Positie in de werkkring
type: CBS begrip
preferred label: Employee @en

Werkzame persoon
type: Concept
related: Positie in de werkkring
type: CBS begrip
preferred label: Employed person @en

Positie in de werkkring
type: Concept
type: CBS begrip
in scheme: Begrippen CBS
preferred label: Employment status @en
definition: Division of the employed labour force by:Employee- fixed- flexibleSelf-employed person- who does not employ others- who employs others- who is a family worker @en
definition: Indeling van de werkzame beroepsbevolking naar: - Werknemer - met een vaste arbeidsrelatie - met een flexibele arbeidsrelatie - Zelfstandige - zonder personeel - met personeel - meewerkend gezinslid
version info: 1
broader: Arbeid en sociale zekerheid
scope note: Als een persoon meer dan één baan of werkkring heeft, dan wordt uitgegaan van de baan of werkkring waaraan de meeste tijd wordt besteed.
source: positie-in-de-werkkring
modified: 2022-02-23T15:55:02Z
created: 2016-03-23T09:05:21Z
related: Zelfstandige
related: Werknemer
related: Werkzame persoon

Begrippen CBS
type: ConceptScheme
preferred label: Concepts Statistics Netherlands @en

CBS begrip
label: CBS concept @en