Verkeer en vervoer
type: Concept
narrower: Containergrootteklasse

Containergrootteklasse
type: Concept
type: CBS begrip
in scheme: Begrippen CBS
preferred label: Container size class @en
definition: De afmeting van een container uitgedrukt in 'voet'.
definition: Size of a container in 'feet' @en
version info: 1
broader: Verkeer en vervoer
scope note: De voornaamste containerafmetingen zijn: a) ISO-container van 20 voet (lengte 20 voet en breedte 8 voet), b) ISO-container van 40 voet (lengte 40 voet en breedte 8 voet), c) ISO-container van meer dan 20 en minder dan 40 voet, d) ISO-container van meer dan 40 voet, e) extra hoge cubecontainer, f) luchttransportcontainer (containers die voldoen aan vastgestelde normen voor luchtvervoer). Containers zijn normaal 8 voet hoog maar ook andere hoogten komen voor. Hoge cubecontainers hebben een hoogte van 9,5 voet. Extra hoge cubecontainers zijn groter dan de ISO-afmetingen. Dergelijke containers kunnen een lengte hebben van 45 voet, 48 voet of 53 voet. Containers met afmetingen zoals bepaald onder a) tot en met e) worden grote containers genoemd.
source: containergrootteklasse
modified: 2022-02-23T15:53:06Z
created: 2016-03-23T09:19:46Z

CBS begrip
label: CBS concept @en

Begrippen CBS
type: ConceptScheme
preferred label: Concepts Statistics Netherlands @en