Verkeer en vervoer
type: Concept
narrower: Lading

Lading
type: Concept
type: CBS begrip
in scheme: Begrippen CBS
preferred label: Cargo @en
definition: De totale hoeveelheid goederen in een vervoermiddel, ingeladen voor commercieel transport naar een (of meerdere) losplaatsen.
definition: The total volume of goods loaded for commercial transport to one or more unloading bays. @en
version info: 1
broader: Verkeer en vervoer
source: lading
modified: 2022-02-23T15:54:11Z
created: 2016-03-23T09:12:43Z

CBS begrip
label: CBS concept @en

Begrippen CBS
type: ConceptScheme
preferred label: Concepts Statistics Netherlands @en