Arbeid en sociale zekerheid
type: Concept
narrower: Uitkeringen wettelijke sociale verzekering in natura

Uitkeringen wettelijke sociale verzekering
type: Concept
related: Uitkeringen wettelijke sociale verzekering in natura
type: CBS begrip
preferred label: Social insurance benefits @en

Uitkeringen wettelijke sociale verzekering in geld
type: Concept
related: Uitkeringen wettelijke sociale verzekering in natura
type: CBS begrip
preferred label: Social security benefits paid in cash @en

Uitkeringen wettelijke sociale verzekering in natura
type: Concept
type: CBS begrip
in scheme: Begrippen CBS
preferred label: Social security benefits in kind @en
definition: Vergoedingen die wettelijke sociale verzekeringsinstellingen in het kader van sociale risico’s en behoeften betalen voor goedgekeurde uitgaven van huishoudens voor bepaalde goederen of diensten.
definition: Goods and services provided to households, based on social security legislation. These are mainly financed by premiums, and seen as government consumption rather than income transfers. @en
version info: 1
broader: Arbeid en sociale zekerheid
scope note: Meestal gaat het om medische of tandheelkundige behandelingen, ziekenhuisaccommodatie, brillen of contactlenzen, medische hulpmiddelen of voorzieningen en soortgelijke goederen of diensten. De dienst wordt rechtstreeks, zonder vergoeding, aan de begunstigden verstrekt door marktproducenten (producenten wiens productie tegen economisch significante prijzen wordt verkocht).
source: uitkeringen-wettelijke-sociale-verzekering-in-natura
modified: 2022-02-23T15:55:51Z
created: 2016-03-23T09:08:27Z
related: Uitkeringen wettelijke sociale verzekering
related: Uitkeringen wettelijke sociale verzekering in geld

Begrippen CBS
type: ConceptScheme
preferred label: Concepts Statistics Netherlands @en

CBS begrip
label: CBS concept @en