Onderwijs
type: Concept
narrower: Speciale scholen

Speciaal onderwijs (so)
type: Concept
related: Speciale scholen
type: CBS begrip
preferred label: Special education @en

Speciaal basisonderwijs (sbao)
type: Concept
related: Speciale scholen
type: CBS begrip
preferred label: Special primary education @en

Speciaal voortgezet onderwijs
type: Concept
related: Speciale scholen
type: CBS begrip
preferred label: Special secondary education @en

Speciale scholen
type: Concept
type: CBS begrip
in scheme: Begrippen CBS
preferred label: Special schools @en
definition: Scholen die basis- en voortgezet onderwijs geven aan zeer moeilijk lerende of opvoedbare kinderen, lichamelijk of zintuiglijk gehandicapte kinderen en langdurig zieken.
definition: Schools providing primary and secondary education to children with learning difficulties and behavioural problems or children with physical or sensory disabilities or chronic illnesses. @en
version info: 1
broader: Onderwijs
scope note: Tot 1998 was er de interimwet speciaal onderwijs en voortgezet speciaal onderwijs (ISOVSO) die al het onderwijs omvatte aan kinderen die, bijvoorbeeld als gevolg van een verstandelijke, lichamelijke of zintuiglijke handicap, meer hulp nodig hadden bij de opvoeding en het leren dan het regulier basis- of voortgezet onderwijs kon bieden. Het ging onder meer om: - zeer moeilijk lerende kinderen (zmlk); - zeer moeilijk opvoedbare kinderen (zmok); - dove kinderen; - slechthorende kinderen; - visueel gehandicapte kinderen; - lichamelijk gehandicapte kinderen; - meervoudig gehandicapte kinderen; - langdurig zieken; - kinderen met ernstige spraakmoeilijkheden; - kinderen in scholen verbonden aan pedologische instituten. Vanaf 1 augustus 1998 is de wetgeving op dit gebied veranderd en zijn bovenstaande onderwijssoorten ondergebracht in de Wet op de Expertisecentra (WEC). Ze worden aangeboden op speciale scholen. Daarbij wordt de opleiding aan kinderen met ernstige spraakmoeilijkheden alleen aangeboden op het ‘niveau’ van het basisonderwijs. De andere opleidingen worden ook aangeboden als voortgezet onderwijs. Tegelijkertijd is al het overige basis- en voortgezet onderwijs dat onder de interimwet speciaal onderwijs en voortgezet speciaal onderwijs (ISOVSO) viel, ondergebracht in de Wet op het Primair Onderwijs (WPO) en de Wet op het Voortgezet Onderwijs (WVO). . Vanaf 1 augustus 2003 zijn de kinderen op de speciale scholen onderverdeeld in vier clusters: - cluster 1 omvat scholen voor visueel gehandicapte kinderen, of meervoudig gehandicapte kinderen met deze handicap; - cluster 2 omvat scholen voor dove kinderen, slechthorende kinderen en kinderen met ernstige spraakmoeilijkheden, of meervoudig gehandicapte kinderen met een van deze handicaps; - cluster 3 omvat scholen voor lichamelijk gehandicapte kinderen, zeer moeilijk lerende kinderen en langdurig zieke kinderen met een lichamelijke handicap, of meervoudig gehandicapte kinderen met een van deze handicaps; - cluster 4 omv…
source: speciale-scholen
modified: 2022-02-23T15:55:31Z
created: 2016-03-23T09:13:45Z
related: Speciaal onderwijs (so)
related: Speciaal basisonderwijs (sbao)
related: Speciaal voortgezet onderwijs

Begrippen CBS
type: ConceptScheme
preferred label: Concepts Statistics Netherlands @en

CBS begrip
label: CBS concept @en