Geografie
type: Concept
narrower: Europese Unie: 15 landen (EU-15)

Europese Unie
type: Concept
related: Europese Unie: 15 landen (EU-15)
type: CBS begrip
preferred label: European Union @en

Europese Unie: 15 landen (EU-15)
type: Concept
type: CBS begrip
in scheme: Begrippen CBS
preferred label: EU-15 @en
definition: De samenstelling van de Europese Unie per 1 januari 1995: België, Duitsland, Denemarken, Finland, Frankrijk, Griekenland, Ierland, Italië, Luxemburg, Nederland, Oostenrijk, Portugal, Spanje, Verenigd Koninkrijk en Zweden.
definition: The composition of the European Union from 1 January 1995: Austria, Belgium, Denmark, Finland, France, Germany, Greece, Ireland, Italy, Luxembourg, the Netherlands, Portugal, Spain, Sweden, and the UK. @en
version info: 1
broader: Geografie
source: europese-unie-15-landen--eu-15--
modified: 2022-02-23T15:53:27Z
created: 2016-03-23T09:11:06Z
related: Europese Unie

Begrippen CBS
type: ConceptScheme
preferred label: Concepts Statistics Netherlands @en

CBS begrip
label: CBS concept @en