Verkeer en vervoer
type: Concept
narrower: Autobeschikbaarheid

Autobeschikbaarheid
type: Concept
type: CBS begrip
in scheme: Begrippen CBS
preferred label: Car availability @en
definition: Het kunnen beschikken over een auto gelet op rijbewijsbezit en beschikbaarheid van een auto in het huishouden.
definition: Having a car at one’s disposal given the number of driver’s licences and cars in a household. @en
version info: 1
broader: Verkeer en vervoer
scope note: De volgende situaties worden onderscheiden: - Geen auto beschikbaar, d.w.z. er is geen auto binnen het huishouden en/of de persoon heeft geen rijbewijs. - Soms auto beschikbaar, d.w.z. er is wel een auto binnen het huishouden en de persoon is rijbewijsbezitter, maar geen autobezitter. - Wel auto beschikbaar, d.w.z. de persoon is rijbewijsbezitter en autobezitter.
source: autobeschikbaarheid
modified: 2022-02-23T15:52:31Z
created: 2016-03-23T09:08:03Z

CBS begrip
label: CBS concept @en

Begrippen CBS
type: ConceptScheme
preferred label: Concepts Statistics Netherlands @en