Macro-economie
type: Concept
narrower: Financiële transacties

Financiële transacties
type: Concept
type: CBS begrip
in scheme: Begrippen CBS
preferred label: Financial transactions @en
definition: Veranderingen in diverse typen vorderingen op en schulden aan andere sectoren en het buitenland. In het algemeen worden veranderingen in vorderingen respectievelijk schulden gemeten als het verschil tussen de verstrekte respectievelijk aangetrokken financiële middelen en de aflossingen. De waarde van de transacties in effecten, zoals aandelen en obligaties, wordt evenwel bepaald als aankoopsaldo (aan de vorderingenkant) en verkoopsaldo (aan de schuldenkant). Herwaarderingen, bijvoorbeeld als gevolg van koersveranderingen, zijn niet begrepen in de financiële transacties.
definition: The changes in acquisitions and liabilities of a sector to other sectors and the rest of the world. These are often mirror images of real transactions, but they can also stand on their own (such as the purchase or sales of stocks and bonds). @en
version info: 1
broader: Macro-economie
scope note: Financiële transacties kunnen twee oorzaken hebben: - een financiële transactie is het gevolg van een lopende of kapitaaltransactie. Beide transacties worden gelijktijdig geregistreerd tegen dezelfde waarde. - een financiële transactie is het gevolg van een andere financiële transactie. Ook hierbij worden de beide transacties gelijktijdig geregistreerd tegen dezelfde waarde. Bij de groepering van de financiële transacties is getracht een tweetal invalshoeken zoveel mogelijk te verenigen: - de aard en vorm van de betrokken transacties. Hiermee ontstaat een beeld van de ontwikkelingen van een aantal deelmarkten van de geld- en kapitaalmarkt. - de looptijd en eventuele overdraagbaarheid van vorderingen en schulden. Dit is van belang bij de beoordeling van de liquiditeit en solvabiliteit per sector.
source: financiele-transacties
modified: 2022-02-23T15:53:30Z
created: 2016-03-23T09:04:21Z

CBS begrip
label: CBS concept @en

Begrippen CBS
type: ConceptScheme
preferred label: Concepts Statistics Netherlands @en