Natuur en milieu
type: Concept
narrower: NMVOS

NMVOS
type: Concept
type: CBS begrip
in scheme: Begrippen CBS
definition: Vluchtige organische stoffen, exclusief methaan. Smogvormend en soms carcinogeen.
definition: Volatile organic substances excluding methane. Forming smog and sometimes carcinogenic. @en
version info: 1
broader: Natuur en milieu
source: nmvos
modified: 2022-02-23T15:54:35Z
created: 2016-03-23T09:09:24Z

CBS begrip
label: CBS concept @en

Begrippen CBS
type: ConceptScheme
preferred label: Concepts Statistics Netherlands @en