Arbeid en sociale zekerheid
type: Concept
narrower: International Standard Classification of Occupations 1988

International Standard Classification of Occupations 1988
type: Concept
type: CBS begrip
in scheme: Begrippen CBS
preferred label: International Standard Classification of Occupations (ISCO) 1988 @en
alternative label: ISCO 1988
definition: De internationale beroepenclassificatie, die in 1988 onder verantwoordelijkheid van de International Labour Organisation (ILO) is herzien en in 1990 uitgebracht.
definition: The International Standard Classification of Occupations revised in 1988 under the supervision of the International Labour Organisation (ILO) and introduced in 1990. @en
version info: 1
broader: Arbeid en sociale zekerheid
scope note: Bij de keuze van de indelingscriteria voor de Standaard Beroepenclassificatie 1992 (SBC 1992) van het CBS is aangesloten bij de uitgangspunten voor herziening van de ISCO 1988: ook in de ISCO 1988 wordt het begrip benodigde bekwaamheden gebruikt. De van de benodigde bekwaamheden afgeleide criteria worden in de ISCO 1988 echter niet systematisch uitgewerkt en toegepast, waardoor de afbakening van beroepen in de ISCO 1988 niet duidelijk is.
source: international-standard-classification-of-occupations-1988--isco-1988--
modified: 2022-02-23T15:54:00Z
created: 2016-03-23T09:09:35Z

CBS begrip
label: CBS concept @en

Begrippen CBS
type: ConceptScheme
preferred label: Concepts Statistics Netherlands @en