Bedrijven
type: Concept
narrower: Bedrijfskosten

Bedrijfsopbrengsten
type: Concept
related: Bedrijfskosten
type: CBS begrip
preferred label: Operating returns @en

Bedrijfsresultaat
type: Concept
related: Bedrijfskosten
type: CBS begrip
preferred label: Operating results @en

Overige bedrijfskosten
type: Concept
related: Bedrijfskosten
type: CBS begrip
preferred label: Other operating costs @en

Bedrijfskosten
type: Concept
type: CBS begrip
in scheme: Begrippen CBS
preferred label: Operating costs @en
definition: The costs made to achieve the operating profits, that is the purchase value of the turnover, labour costs, and depreciation on assets, and other business expenditure. @en
definition: De kosten die zijn gemaakt om de bedrijfsopbrengsten te realiseren, te weten de inkoopwaarde van de omzet, de arbeidskosten (Productiestatistieken), de afschrijvingen op vaste activa en de zgn. overige bedrijfskosten.
version info: 1
broader: Bedrijven
source: bedrijfskosten
modified: 2022-02-23T15:52:35Z
created: 2016-03-23T09:12:53Z
related: Bedrijfsopbrengsten
related: Bedrijfsresultaat
related: Overige bedrijfskosten

Begrippen CBS
type: ConceptScheme
preferred label: Concepts Statistics Netherlands @en

CBS begrip
label: CBS concept @en