Onderwijs
type: Concept
narrower: Speciaal onderwijs (so)

Speciaal basisonderwijs (sbao)
type: Concept
related: Speciaal onderwijs (so)
type: CBS begrip
preferred label: Special primary education @en

Speciale scholen
type: Concept
related: Speciaal onderwijs (so)
type: CBS begrip
preferred label: Special schools @en

Moeilijk lerende kinderen
type: Concept
related: Speciaal onderwijs (so)
type: CBS begrip
preferred label: Children with moderate learning difficulties @en

Speciaal onderwijs (so)
type: Concept
type: CBS begrip
in scheme: Begrippen CBS
preferred label: Special education @en
definition: Tot 1998 basisonderwijs voor kinderen die een speciale benadering nodig hadden wegens gedrags- of leerproblemen of wegens een lichamelijke handicap.
definition: Until 1998 primary education for children requiring a special approach due to behavioural problems, learning disabilities or physical problems (from the age of four). @en
version info: 1
broader: Onderwijs
scope note: Tot 1998 was er de interimwet speciaal onderwijs en voortgezet speciaal onderwijs (ISOVSO) die al het onderwijs omvatte aan kinderen die, bijvoorbeeld als gevolg van een verstandelijke, lichamelijke of zintuiglijke handicap, meer hulp nodig hadden bij de opvoeding en het leren dan het regulier basis- of voortgezet onderwijs kon bieden. Het ging om: - kinderen met leer- en opvoedingsmoeilijkheden (lom); - moeilijk lerende kinderen (mlk); - in hun ontwikkeling bedreigde kleuters (iobk); - zeer moeilijk lerende kinderen (zmlk); - zeer moeilijk opvoedbare kinderen (zmok); - dove kinderen; - slechthorende kinderen; - visueel gehandicapte kinderen; - lichamelijk gehandicapte kinderen; - meervoudig gehandicapte kinderen; - langdurig zieken; - kinderen met ernstige spraakmoeilijkheden; - kinderen in scholen verbonden aan pedologische instituten. Vanaf 1 augustus 1998 is de wetgeving op dit gebied veranderd en zijn de voormalige onderwijssoorten lom, mlk en iobk (voor zover verbonden aan scholen voor so-lom en so-mlk) opgenomen in de Wet op het Primair Onderwijs (WPO) en de Wet op het Voortgezet Onderwijs (WVO). Vanaf dat tijdstip wordt het basisonderwijs aan deze drie groepen gegeven op scholen voor speciaal basisonderwijs. Het voortgezet onderwijs werd in eerste instantie aangeboden op scholen voor speciaal voortgezet onderwijs (svo). In de periode augustus 1998 tot augustus 2002 is het svo-lom vooral overgegaan naar het leerwegondersteunend onderwijs (lwoo) op het vmbo en is het svo-mlk vooral omgezet in praktijkonderwijs. Vanaf 1 augustus 1998 zijn alle overige onderwijssoorten die onder de ISOVSO vielen, ondergebracht in de Wet op de Expertisecentra (WEC). Ze worden aangeboden op speciale scholen. Daarbij wordt de opleiding aan kinderen met ernstige spraakmoeilijkheden alleen aangeboden op het ‘niveau’ van het basisonderwijs. De andere opleidingen worden ook aangeboden als voortgezet onderwijs. Daarnaast biedt de Wet op de Expertisecentra (WEC) de mogelijkheid om kinder…
source: speciaal-onderwijs--so--
modified: 2022-02-23T15:55:30Z
created: 2016-03-23T09:05:36Z
related: Speciaal basisonderwijs (sbao)
related: Speciale scholen
related: Moeilijk lerende kinderen

Begrippen CBS
type: ConceptScheme
preferred label: Concepts Statistics Netherlands @en

CBS begrip
label: CBS concept @en