Arbeid en sociale zekerheid
type: Concept
narrower: Thuiswerker

Thuisarbeid
type: Concept
related: Thuiswerker
type: CBS begrip
preferred label: Home work @en

Thuiswerker
type: Concept
type: CBS begrip
in scheme: Begrippen CBS
preferred label: People working from home @en
definition: Een persoon die een overeenkomst sluit met een bedrijf of andere persoon om thuis - buiten de directe controle van de andere partij om - werkzaamheden te verrichten tegen een vooraf afgesproken vergoeding, zonder daarbij gebruik te maken van meer dan twee hulpkrachten van buiten het eigen gezin.
definition: Someone who agrees to work for another person or company from home – outside the direct control of the other party - for a preset amount, not using more than two helpers from outside the family. @en
note: Vorige definitie: Een persoon die een overeenkomst sluit met een bedrijf of andere persoon om thuis - buiten de directe controle van de andere partij om - werkzaamheden te verrichten tegen een vooraf afgesproken vergoeding, zonder daarbij gebruik te maken van meer dan twee
version info: 2
broader: Arbeid en sociale zekerheid
source: thuiswerker
modified: 2023-03-29T15:52:14Z
created: 2016-03-23T09:07:24Z
history note: De definitie is aangepast
related: Thuisarbeid

Begrippen CBS
type: ConceptScheme
preferred label: Concepts Statistics Netherlands @en

CBS begrip
label: CBS concept @en