Veiligheid en recht
type: Concept
narrower: Derdelander

Derdelander
type: Concept
type: CBS begrip
in scheme: Begrippen CBS
definition: Persoon met een andere nationaliteit dan die van één van de lidstaten van de Europese Unie, Noorwegen, IJsland, Liechtenstein of Zwitserland.
version info: 1
broader: Veiligheid en recht
scope note: Ook staatlozen worden tot derdelanders gerekend.
source: derdelander
modified: 2022-02-23T15:53:13Z
created: 2016-03-23T09:19:25Z

CBS begrip
label: CBS concept @en

Begrippen CBS
type: ConceptScheme
preferred label: Concepts Statistics Netherlands @en