Bedrijven
type: Concept
narrower: Financiële beurs-NV

Financiële intermediatie
type: Concept
related: Financiële beurs-NV
type: CBS begrip
preferred label: Financial intermediation @en

Financiële beurs-NV
type: Concept
type: CBS begrip
in scheme: Begrippen CBS
preferred label: Financial company quoted on the Amsterdam Stock exchange @en
definition: Onderneming waarvan de hoofdactiviteit bestaat uit financiële intermediatie en waarvan de aandelen of certificaten van aandelen zijn opgenomen in de officiële notering van de Amsterdamse effectenbeurs (Euronext).
definition: Company that has financial intermediation as its main activity and whose shares or certificates are included officially on the Amsterdam Stock Exchange (Euronext). @en
version info: 1
broader: Bedrijven
source: financiele-beurs-nv
modified: 2022-02-23T15:53:30Z
created: 2016-03-23T09:07:07Z
related: Financiële intermediatie

Begrippen CBS
type: ConceptScheme
preferred label: Concepts Statistics Netherlands @en

CBS begrip
label: CBS concept @en