Bedrijven
type: Concept
narrower: Stichting

Rechtspersoon
type: Concept
related: Stichting
type: CBS begrip
preferred label: Legal entity @en

Stichting
type: Concept
type: CBS begrip
in scheme: Begrippen CBS
preferred label: Foundation @en
definition: Rechtspersoon, bij notariële akte of testament opgericht door één of meer personen om een bepaald doel te bereiken met behulp van een vermogen. Er mag winst worden gemaakt maar deze moet ten goede komen aan een ideëel of maatschappelijk doel.
definition: A legal person created through a notarised deed or will to serve a certain purpose with the aid of capital. It may generate profits, but these must be paid to an idealistic or social purpose. @en
version info: 1
broader: Bedrijven
scope note: Een stichting kan worden opgericht door natuurlijke en/of niet-natuurlijke personen. Zodra de verplichte inschrijving in het handelsregister heeft plaatsgevonden zijn de bestuurders niet meer privé aansprakelijk voor verplichtingen van de rechtspersoon.
source: stichting
modified: 2022-02-23T15:55:37Z
created: 2016-03-23T09:15:35Z
related: Rechtspersoon

Begrippen CBS
type: ConceptScheme
preferred label: Concepts Statistics Netherlands @en

CBS begrip
label: CBS concept @en