Arbeid en sociale zekerheid
type: Concept
narrower: Beroep (arbeid)

Beroepenindeling ROA CBS 2014
type: Concept
related: Beroep (arbeid)
type: CBS begrip

Beroep (arbeid)
type: Concept
type: CBS begrip
in scheme: Begrippen CBS
preferred label: Occupation @en
definition: De verzameling van werkzaamheden en taken, die behoren tot een baan van een persoon.
definition: The set of tasks and work that are part of someone’s job. @en
version info: 1
broader: Arbeid en sociale zekerheid
scope note: Op het meest gedetailleerde niveau van de Beroepenindeling ROA CBS 2014 (BRC 2014) wordt een verzameling van gelijksoortige takenpakketten een “beroep” genoemd. De beroepen zijn gelijk aan de unit groups van de ISCO 2008 die aan de basis staan van de BRC 2014. Er worden 436 beroepen/unit groups onderscheiden. De ISCO hanteert 2 indelingscriteria, ‘skill level’ en ‘skill specialisation’, ofwel het niveau en de richting van de benodigde bekwaamheden om de takenpaketten van elkaar te onderscheiden. Het CBS gebruikt vanaf verslagjaar 2012 alleen nog de ISCO 2008 als standaard om over beroep te publiceren. Ten behoeve van de codering van het beroep wordt gebruik gemaakt van een deels open deels gesloten vraagstelling die de volgende informatie dient te verschaffen: - de beroeps- of functiebenaming; - het al dan niet leidinggeven; - indien leiding wordt gegeven: het aantal personen waarover direct of indirect leiding wordt gegeven; - indien leiding wordt gegeven: het soort leidinggevende werkzaamheden - de voornaamste werkzaamheden.
source: beroep--arbeid--
modified: 2022-02-23T15:52:40Z
created: 2016-03-23T09:03:55Z
related: Beroepenindeling ROA CBS 2014

Begrippen CBS
type: ConceptScheme
preferred label: Concepts Statistics Netherlands @en

CBS begrip
label: CBS concept @en