Onderwijs
type: Concept
narrower: Duaal onderwijs

Opleidingsvorm
type: Concept
related: Duaal onderwijs
type: CBS begrip

Duaal onderwijs
type: Concept
type: CBS begrip
in scheme: Begrippen CBS
definition: Onderwijs waarbij werken en leren worden gecombineerd.
version info: 1
broader: Onderwijs
scope note: Duaal leren is meer dan stage lopen. De leerprocessen op de opleiding en op de werkplek vullen elkaar aan en versterken elkaar. Soms krijgt een scholier of student opdrachten vanuit de opleiding mee die op de werkplek moeten worden uitgevoerd. Omgekeerd komt de opgedane werkervaring terug in de lessen of colleges van de opleiding die men volgt. Duale opleidingen komen vooral voor in het middelbaar beroepsonderwijs (bbl) en het hoger beroepsonderwijs.
source: duaal-onderwijs
modified: 2022-02-23T15:53:17Z
created: 2016-03-23T09:14:27Z
related: Opleidingsvorm

Begrippen CBS
type: ConceptScheme
preferred label: Concepts Statistics Netherlands @en

CBS begrip
label: CBS concept @en