Verkeer en vervoer
type: Concept
narrower: Brutotonnage

Brutotonnage
type: Concept
type: CBS begrip
in scheme: Begrippen CBS
preferred label: Gross tonnage @en
alternative label: Bt
definition: De (inhouds)maat voor de totale grootte van een schip, bepaald overeenkomstig het Internationaal Verdrag betreffende de meting van schepen uit 1969.
definition: The measure for the total cubic capacity of the ship in accordance with the International Convention on Tonnage Measurement of Ships of 1969. @en
version info: 1
broader: Verkeer en vervoer
scope note: Het brutotonnage wordt berekend met een formule waarin is opgenomen het scheepsvolume onder het bovendek en de ingesloten ruimten boven het bovendek. Het verkregen volume wordt vermenigvuldigd met een factor waarna het gevonden getal onbenoemd is. Er staat dus geen T of m3 achter het getal.
source: brutotonnage--bt--
modified: 2022-02-23T15:52:56Z
created: 2016-03-23T09:09:12Z

CBS begrip
label: CBS concept @en

Begrippen CBS
type: ConceptScheme
preferred label: Concepts Statistics Netherlands @en