Macro-economie
type: Concept
narrower: Koopkrachtpariteit

Koopkrachtpariteit
type: Concept
type: CBS begrip
in scheme: Begrippen CBS
preferred label: Purchasing power parity (PPP) @en
definition: Manier om de koopkracht van huishoudens in landen te vergelijken, waarbij gecorrigeerd wordt voor prijsverschillen.
definition: Spatial deflator and currency convertor, which eliminates the effects of differences in price levels, thus allowing volume comparisons per capita of GDP components and comparisons of price levels. @en
version info: 1
broader: Macro-economie
scope note: PPPs vergelijken de koopkracht van geldeenheden tussen verschillende landen. Een koopkrachtpariteit tussen 2 landen geeft aan hoeveel je van de valuta van het ene land moet uitgeven om hetzelfde te kunnen voor 1 eenheid van de valuta in het andere land. Bijvoorbeeld: PPP Land X <-> Nederland = 103: Voor iedere euro in NL moet je 103 <valuta Land X> uitgeven om hetzelfde in Land X te kunnen kopen. PPPs kunnen ook tussen landen met dezelfde eenheid worden berekend, in dit geval geven ze gewoon prijsverschillen weer. Stel: PPP Frankrijk <-> NL = 1,05 -> Frankrijk is gemiddeld 5% duurder dan Nederland.
source: koopkrachtpariteit
modified: 2022-02-23T15:54:09Z
created: 2016-03-23T09:04:47Z

CBS begrip
label: CBS concept @en

Begrippen CBS
type: ConceptScheme
preferred label: Concepts Statistics Netherlands @en