Arbeid en sociale zekerheid
type: Concept
narrower: Wet arbeidsongeschiktheidsverzekering zelfstandigen

Wet arbeidsongeschiktheidsverzekering zelfstandigen
type: Concept
type: CBS begrip
in scheme: Begrippen CBS
preferred label: Disablement act for the self-employed (WAZ) @en
alternative label: WAZ
definition: Een verplichte verzekering voor zelfstandigen, beroepsbeoefenaren, directeuren-grootaandeelhouders en meewerkende echtgenoten tegen de financiële gevolgen van langdurige arbeidsongeschiktheid.
definition: A compulsory insurance (WAZ) against long-term disablement for self-employed people, directors/major shareholders and spouses working in the family business. @en
version info: 1
broader: Arbeid en sociale zekerheid
scope note: Verzekerden die voor 1 augustus 2004 arbeidsongeschikt zijn geworden, kunnen nog in aanmerking komen voor een uitkering. De toegang tot de WAZ is met ingang van 1 augustus 2004 voor nieuwe gevallen geblokkeerd. Bestaande WAZ-uitkeringen blijven doorlopen.
source: wet-arbeidsongeschiktheidsverzekering-zelfstandigen
modified: 2022-02-23T15:56:25Z
created: 2016-03-23T09:10:00Z

CBS begrip
label: CBS concept @en

Begrippen CBS
type: ConceptScheme
preferred label: Concepts Statistics Netherlands @en