Arbeid en sociale zekerheid
type: Concept
narrower: Werkloze beroepsbevolking (12-uursgrens)

Werkloos
type: Concept
related: Werkloze beroepsbevolking (12-uursgrens)
type: CBS begrip
preferred label: Unemployed @en

Werkloosheid
type: Concept
related: Werkloze beroepsbevolking (12-uursgrens)
type: CBS begrip
preferred label: Unemployment @en

Werkloze beroepsbevolking (12-uursgrens)
type: Concept
type: CBS begrip
in scheme: Begrippen CBS
preferred label: Unemployed labour force (12-hours threshold) @en
definition: Personen die geen betaald werk hebben of voor minder dan twaalf uur per week, recent naar werk voor twaalf uur of meer per week hebben gezocht en daarvoor direct beschikbaar zijn.
definition: People who don't have paid work or for less than twelve hours per week, recently looked for work for twelve hours or more per week and are directly available for it. @en
version info: 1
broader: Arbeid en sociale zekerheid
scope note: Deze definitie van de werkloze beroepsbevolking stond tot 2015 centraal in de berichtgeving door het CBS. De definitie heeft betrekking op personen die in Nederland wonen (exclusief de institutionele bevolking). De gegevens worden meestal gepresenteerd voor de bevolking van 15 tot 65 jaar.
source: werkloze-beroepsbevolking--12-uursgrens--
modified: 2022-02-23T15:56:24Z
created: 2016-03-23T09:19:19Z
related: Werkloos
related: Werkloosheid

Begrippen CBS
type: ConceptScheme
preferred label: Concepts Statistics Netherlands @en

CBS begrip
label: CBS concept @en