Arbeid en sociale zekerheid
type: Concept
narrower: Onbetaalde arbeid (TBO)

Arbeid
type: Concept
related: Onbetaalde arbeid (TBO)
type: CBS begrip
preferred label: Labour @en

Onbetaalde arbeid (NR)
type: Concept
related: Onbetaalde arbeid (TBO)
type: CBS begrip
preferred label: Unpaid work (NA) @en

Onbetaalde arbeid (TBO)
type: Concept
type: CBS begrip
in scheme: Begrippen CBS
preferred label: Unpaid work (TBO) @en
definition: Het verrichten van onbetaalde productieve activiteiten. Dit omvat huishoudelijke werkzaamheden, kinderverzorging, vrijwilligerswerk, hulp aan en verzorging van anderen, klussen en karweitjes, en de met deze activiteiten gemoeide reistijd.
definition: Engaging in productive but unpaid activities. These include household chores, caring for children, volunteer work, helping and caring for other people, DIY and odd jobs, and the travelling time involved for these activities. @en
version info: 1
broader: Arbeid en sociale zekerheid
scope note: Definitie volgens het Tijdsbestedingsonderzoek (TBO). Conform deze definitie worden ook werkzaamheden in het eigen huishouden, verzorging van eigen kinderen e.d. tot onbetaalde arbeid gerekend. Activiteiten die niet aan derden kunnen worden uitbesteed, zoals studie, worden niet als zodanig aangemerkt. Sinds 1997 vindt actualisering van dit gegeven alleen nog plaats in het kader van de Statline-publicatie 'Sociale Monitor' waarbij echter, in tegenstelling tot voorgaande jaren en in afwijking van de definitie, de reistijd buiten beschouwing blijft.
source: onbetaalde-arbeid--tbo--
modified: 2022-02-23T15:54:38Z
created: 2016-03-23T09:07:29Z
related: Arbeid
related: Onbetaalde arbeid (NR)

Begrippen CBS
type: ConceptScheme
preferred label: Concepts Statistics Netherlands @en

CBS begrip
label: CBS concept @en