Bevolking
type: Concept
narrower: Immigratie

Europese Blue card
type: Concept
related: Immigratie
type: CBS begrip

Buitenlandse migratie
type: Concept
related: Immigratie
type: CBS begrip
preferred label: International migration @en

Kenniswerker
type: Concept
related: Immigratie
type: CBS begrip

Onderzoeker (arbeidsmigratie)
type: Concept
related: Immigratie
type: CBS begrip

Immigratie
type: Concept
type: CBS begrip
in scheme: Begrippen CBS
preferred label: Immigration @en
definition: Vestiging van personen vanuit het buitenland in Nederland.
definition: People moving to the Netherlands from another country. @en
version info: 1
broader: Bevolking
scope note: Om als immigrant te kunnen worden geteld dienen deze personen ingeschreven te worden in de gemeentelijke bevolkingsregisters. Tot en met september 1994: een aantal speciale gevallen uitgezonderd, vond opneming voor een persoon met de Nederlandse nationaliteit plaats als deze zich voor langer dan 30 dagen dacht te vestigen en voor een persoon met een niet-Nederlandse nationaliteit als de verwachte vestigingsduur de 180 dagen overschreed. Vanaf oktober 1994: men wordt ingeschreven als men verwacht minimaal vier maanden in Nederland te blijven.
source: immigratie
modified: 2022-02-23T15:53:53Z
created: 2016-03-23T09:04:36Z
related: Europese Blue card
related: Buitenlandse migratie
related: Kenniswerker
related: Onderzoeker (arbeidsmigratie)

Begrippen CBS
type: ConceptScheme
preferred label: Concepts Statistics Netherlands @en

CBS begrip
label: CBS concept @en