Bedrijven
type: Concept
narrower: Automatiseringskosten

Automatiseringskosten
type: Concept
type: CBS begrip
in scheme: Begrippen CBS
preferred label: Computer costs @en
definition: Aan derden betaalde bedragen voor automatisering en ook de niet-geactiveerde aanschafkosten van automatiseringsapparatuur en software.
definition: Amounts paid to third parties for computerisation and non-capitalized acquisition of automation equipment and software @en
version info: 1
broader: Bedrijven
scope note: Niet-geactiveerd wil zeggen niet op de balans opgenomen.
source: automatiseringskosten
modified: 2022-02-23T15:52:32Z
created: 2016-03-23T09:08:52Z

CBS begrip
label: CBS concept @en

Begrippen CBS
type: ConceptScheme
preferred label: Concepts Statistics Netherlands @en